敦煌壁画主题词表本体模型(Dunhuang Mural Thesaurus Ontology)
type: Ontology
rights: 版权所有©武汉大学数字人文研究中心。
comment: 敦煌壁画主题词表构建与关联数据发布项目，围绕敦煌壁画主题词表的构建，使用人机协同的词表编制与构建方法，利用自然语言处理与机器学习技术，从敦煌学研究语料库中自动提取领域主题词，并通过人工的主题词归类、概念间关系的定义以及质量校对，实现人机协同的词表主题词不断充实与完善。在此基础上，遵循W3C词表RDF发布的最佳实践，在参考SKOS模型与盖蒂词表本体模型的基础上，建立敦煌壁画主题词表本体模型以规范词表的语义转换，本体模型通过定义类、关系与属性等清晰展现主题词表的层级结构与主题词间的语义关系。
description: 敦煌壁画主题词表本体是在敦煌壁画叙词表逻辑结构的基础上，定义了类、属性、关系等以规范叙词表的语义转换，同时通过本体模型更好了理解主题词表数据集的数据结构。依据本体构建的原则与方法，该本体复用盖蒂词表的GVP本体 、SKOS数据模型以及DCMI元数据术语中的元素。本体模型中的分面和层级参考复用GVP本体中的分面和层级类，概念类使用SKOS中的Concept类进行表示。同时，敦煌壁画主题词表中术语间的关系包含等级关系（hierarchical relationship）、等同关系（equivalence relationship）以及相关关系（associative relationship）等；具体体现为术语间的上位词（broader term）、下位词（narrower term）、同义词（synonymous term）、相关术语（related terms）等。
creator: 王晓光

creator
type: AnnotationProperty
comment: 主题词表创建者

description
type: AnnotationProperty
comment: 主题词表的描述与说明。

rights
type: AnnotationProperty
comment: 版权所有者

title
type: AnnotationProperty
comment: 主题词表的正式名称。

contributor
type: AnnotationProperty
comment: 主题词表的贡献者。

created
type: AnnotationProperty
comment: 主题词的创建时间

source
type: AnnotationProperty
comment: 数据来源，记录主题词或注释信息的来源。

altLabel
type: AnnotationProperty
comment: 非首选标签
sub property of: label

hiddenLabel
type: AnnotationProperty
comment: 隐藏标签
sub property of: label

note
type: AnnotationProperty
comment: 注释

prefLabel
type: AnnotationProperty
comment: 首选标签
sub property of: label

scopeNote
type: AnnotationProperty
comment: 范围注释
sub property of: note

broader
type: ObjectProperty
domain: Concept
range: Facet
range: Hierarchy
range: Concept
comment: Relates a concept to a concept that is more general in meaning. @en
comment: 上位关系

exactMatch
type: ObjectProperty
domain: Concept
range: Concept
comment: skos:exactMatch is used to link two concepts, indicating a high degree of confidence that the concepts can be used interchangeably across a wide range of information retrieval applications. skos:exactMatch is a transitive property, and is a sub-property of skos:closeMatch. @en
comment: 等同关系，主要用于与外部词表的关联。比如：“菩萨”概念与AAT中的“aat:300264360”关联。

hasTopConcept
type: ObjectProperty
domain: ConceptScheme
range: Facet
comment: Relates, by convention, a concept scheme to a concept which is topmost in the broader/narrower concept hierarchies for that scheme, providing an entry point to these hierarchies. @en
comment: 顶级概念属性，用于表示叙词表的分面。

inScheme
type: ObjectProperty
domain: Concept
range: ConceptScheme
comment: 归属概念体系属性；指某个概念在词表体系中。

narrower
type: ObjectProperty
domain: Facet
domain: Concept
range: Hierarchy
range: Concept
comment: Relates a concept to a concept that is more specific in meaning. @en
comment: 下位关系

related
type: ObjectProperty
domain: Concept
range: Concept
comment: Relates a concept to a concept with which there is an associative semantic relationship. @en
comment: 相关术语

Concept
type: Class
comment: GVP本体模型中的概念类；敦煌主题词表中的主题词通过exacMatch对象属性与其建立关联。

Facet
type: Class
comment: 主题词表的分面，一个分面可以看作是某种方式聚集的一组概念的集合。

Hierarchy
type: Class
comment: 主题词表的层级，用于构建主题词表分类层级，不用于创建索引和编目。

Concept
type: Class
comment: An idea or notion; a unit of thought @en
comment: 主题词表中的主题词或术语

ConceptScheme
type: Class
comment: A set of concepts, optionally including statements about semantic relationships between those concepts. @en
comment: 主题词表概念体系类